Target
Vascular endothelial growth factor receptor 1
Ligand
BDBM17015
Substrate
Meas. Tech.
ChEMBL_214499 (CHEMBL818398)
IC50
390±n/a nM
Citation
 Sun, LTran, NTang, FApp, HHirth, PMcMahon, GTang, C Synthesis and biological evaluations of 3-substituted indolin-2-ones: a novel class of tyrosine kinase inhibitors that exhibit selectivity toward particular receptor tyrosine kinases. J Med Chem 41:2588-603 (1998)  
Target
Name:
Vascular endothelial growth factor receptor 1
Synonyms:
Emrk2 Flt1 Vegfr1
Type:
PROTEIN
Mol. Mass.:
149906.69
Organism:
Mus musculus
Description:
ChEMBL_820931
Residue:
1333
  
Inhibitor
Name:
BDBM17015
Synonyms:
(3Z)-3-(1H-pyrrol-2-ylmethylidene)-2,3-dihydro-1H-indol-2-one Indolinone based inhibitor, 1 | Oxindole I
Type:
Small organic molecule
Emp. Form.:
C13H10N2O
Mol. Mass.:
210.2313
SMILES:
O=C1Nc2ccccc2\C1=C\c1ccc[nH]1
: