Target
Epidermal growth factor receptor
Ligand
BDBM17015
Substrate
Meas. Tech.
ChEMBL_63615 (CHEMBL676159)
IC50
>100000±n/a nM
Citation
 Sun, LTran, NTang, FApp, HHirth, PMcMahon, GTang, C Synthesis and biological evaluations of 3-substituted indolin-2-ones: a novel class of tyrosine kinase inhibitors that exhibit selectivity toward particular receptor tyrosine kinases. J Med Chem 41:2588-603 (1998)  
Target
Name:
Epidermal growth factor receptor
Synonyms:
EGF Receptor Substrate EGFR_HUMAN ERBB1 Epidermal Growth Factor Receptor erbB-1 Epidermal growth factor receptor (EGFR) HER1 Proto-oncogene c-ErbB-1 Tyrosine-Protein Kinase ErbB-1
Type:
Receptor Kinase Domain
Mol. Mass.:
134279.59
Organism:
Homo sapiens (Human)
Description:
P00533
Residue:
1210
  
Inhibitor
Name:
BDBM17015
Synonyms:
(3Z)-3-(1H-pyrrol-2-ylmethylidene)-2,3-dihydro-1H-indol-2-one Indolinone based inhibitor, 1 | Oxindole I
Type:
Small organic molecule
Emp. Form.:
C13H10N2O
Mol. Mass.:
210.2313
SMILES:
O=C1Nc2ccccc2\C1=C\c1ccc[nH]1
: