Target
Vascular endothelial growth factor receptor 1
Ligand
BDBM50065315
Substrate
Meas. Tech.
ChEMBL_214499 (CHEMBL818398)
IC50
22600±n/a nM
Citation
 Sun, LTran, NTang, FApp, HHirth, PMcMahon, GTang, C Synthesis and biological evaluations of 3-substituted indolin-2-ones: a novel class of tyrosine kinase inhibitors that exhibit selectivity toward particular receptor tyrosine kinases. J Med Chem 41:2588-603 (1998)  
Target
Name:
Vascular endothelial growth factor receptor 1
Synonyms:
Emrk2 Flt1 Vegfr1
Type:
PROTEIN
Mol. Mass.:
149906.69
Organism:
Mus musculus
Description:
ChEMBL_820931
Residue:
1333
  
Inhibitor
Name:
BDBM50065315
Synonyms:
3-[1-(4-Dimethylamino-phenyl)-meth-(Z)-ylidene]-1-methyl-1,3-dihydro-indol-2-one | CHEMBL86921
Type:
Small organic molecule
Emp. Form.:
C18H18N2O
Mol. Mass.:
278.3483
SMILES:
CN(C)c1ccc(\C=C2/C(=O)N(C)c3ccccc23)cc1
: