Target
Vascular endothelial growth factor receptor 1
Ligand
BDBM50065308
Substrate
Meas. Tech.
ChEMBL_214499 (CHEMBL818398)
IC50
70.0±n/a nM
Citation
 Sun, LTran, NTang, FApp, HHirth, PMcMahon, GTang, C Synthesis and biological evaluations of 3-substituted indolin-2-ones: a novel class of tyrosine kinase inhibitors that exhibit selectivity toward particular receptor tyrosine kinases. J Med Chem 41:2588-603 (1998)  
Target
Name:
Vascular endothelial growth factor receptor 1
Synonyms:
Emrk2 Flt1 Vegfr1
Type:
PROTEIN
Mol. Mass.:
149906.69
Organism:
Mus musculus
Description:
ChEMBL_820931
Residue:
1333
  
Inhibitor
Name:
BDBM50065308
Synonyms:
(Z )-3-[(2,4-dimethyl-3-(ethoxycarbonyl)pyrrol-5-yl)methylidenyl]indolin-2-one 2,4-Dimethyl-5-[2-oxo-1,2-dihydro-indol-(3Z)-ylidenemethyl]-1H-pyrrole-3-carboxylic acid ethyl ester | CHEMBL86943
Type:
Small organic molecule
Emp. Form.:
C18H18N2O3
Mol. Mass.:
310.3471
SMILES:
CCOC(=O)c1c(C)[nH]c(\C=C2/C(=O)Nc3ccccc23)c1C
: