Target
Receptor tyrosine-protein kinase erbB-2
Ligand
BDBM50065271
Substrate
Meas. Tech.
ChEMBL_78751 (CHEMBL686676)
IC50
7000±n/a nM
Citation
 Sun, LTran, NTang, FApp, HHirth, PMcMahon, GTang, C Synthesis and biological evaluations of 3-substituted indolin-2-ones: a novel class of tyrosine kinase inhibitors that exhibit selectivity toward particular receptor tyrosine kinases. J Med Chem 41:2588-603 (1998)  
Target
Name:
Receptor tyrosine-protein kinase erbB-2
Synonyms:
2.7.10.1 CD_antigen=CD340 ERBB2_HUMAN FASN/HER2 HER2 MLN19 NEU Proto-oncogene Neu Tyrosine kinase-type cell surface receptor HER2 | p185erbB2
Type:
Mol. Mass.:
137894.47
Organism:
Homo sapiens (Human)
Description:
P04626
Residue:
1255
  
Inhibitor
Name:
BDBM50065271
Synonyms:
3-(4-hydroxy-3,5-diisopropylbenzylidene)indolin-2-one CHEMBL85021 | ST-280
Type:
Small organic molecule
Emp. Form.:
C21H23NO2
Mol. Mass.:
321.4128
SMILES:
CC(C)c1cc(\C=C2/C(=O)Nc3ccccc23)cc(C(C)C)c1O
: