Target
Epidermal growth factor receptor
Ligand
BDBM50065302
Substrate
Meas. Tech.
ChEMBL_63615 (CHEMBL676159)
IC50
>100000±n/a nM
Citation
 Sun, LTran, NTang, FApp, HHirth, PMcMahon, GTang, C Synthesis and biological evaluations of 3-substituted indolin-2-ones: a novel class of tyrosine kinase inhibitors that exhibit selectivity toward particular receptor tyrosine kinases. J Med Chem 41:2588-603 (1998)  
Target
Name:
Epidermal growth factor receptor
Synonyms:
EGF Receptor Substrate EGFR_HUMAN ERBB1 Epidermal Growth Factor Receptor erbB-1 Epidermal growth factor receptor (EGFR) HER1 Proto-oncogene c-ErbB-1 Tyrosine-Protein Kinase ErbB-1
Type:
Receptor Kinase Domain
Mol. Mass.:
134279.59
Organism:
Homo sapiens (Human)
Description:
P00533
Residue:
1210
  
Inhibitor
Name:
BDBM50065302
Synonyms:
6-Fluoro-3-[1-(1H-pyrrol-2-yl)-meth-(Z)-ylidene]-1,3-dihydro-indol-2-one | CHEMBL87208
Type:
Small organic molecule
Emp. Form.:
C13H9FN2O
Mol. Mass.:
228.2218
SMILES:
Fc1ccc2\C(=C\c3ccc[nH]3)C(=O)Nc2c1
: