Target
Somatostatin receptor type 1
Ligand
BDBM50065453
Substrate
Meas. Tech.
ChEMBL_200360 (CHEMBL807427)
Ki
>1000±n/a nM
Citation
 Tran, TAMattern, RHAfargan, MAmitay, OZiv, OMorgan, BATaylor, JEHoyer, DGoodman, M Design, synthesis, and biological activities of potent and selective somatostatin analogues incorporating novel peptoid residues. J Med Chem 41:2679-85 (1998)  
Target
Name:
Somatostatin receptor type 1
Synonyms:
SOMATOSTATIN SST1 SS-1-R SS1R SSTR1 | Somatostatin receptor type 1 (SSTR1)
Type:
Enzyme
Mol. Mass.:
42692.81
Organism:
Homo sapiens (Human)
Description:
P30872
Residue:
391
  
Inhibitor
Name:
BDBM50065453
Synonyms:
(5S,8S,11S,14R,17S,19aS)-11-(4-Amino-butyl)-5,17-dibenzyl-8-((R)-1-hydroxy-ethyl)-14-(1H-indol-3-ylmethyl)-tetradecahydro-3a,6,9,12,15,18-hexaaza-cyclopentacyclooctadecene-4,7,10,13,16,19-hexaone L-361,301 L-363301
Type:
Small organic molecule
Emp. Form.:
C44H54N8O7
Mol. Mass.:
806.949
SMILES:
C[C@@H](O)[C@@H]1NC(=O)[C@H](CCCCN)NC(=O)[C@@H](Cc2c[nH]c3ccccc23)NC(=O)[C@H](Cc2ccccc2)NC(=O)[C@@H]2CCCN2C(=O)[C@H](Cc2ccccc2)NC1=O
: