Target
Neuropeptide Y receptor type 1
Ligand
BDBM50065468
Substrate
Meas. Tech.
ChEMBL_143830 (CHEMBL748714)
Ki
1.7±n/a nM
Citation
 Zarrinmayeh, HNunes, AMOrnstein, PLZimmerman, DMArnold, MBSchober, DAGackenheimer, SLBruns, RFHipskind, PABritton, TCCantrell, BEGehlert, DR Synthesis and evaluation of a series of novel 2-[(4-chlorophenoxy)methyl]benzimidazoles as selective neuropeptide Y Y1 receptor antagonists. J Med Chem 41:2709-19 (1998)  
Target
Name:
Neuropeptide Y receptor type 1
Synonyms:
NPY-Y1 NPY1R NPYR neuropeptide Y receptor Y1
Type:
Enzyme Catalytic Domain
Mol. Mass.:
44399.07
Organism:
Homo sapiens (Human)
Description:
NPY-Y1 NPY1R HUMAN::P25929
Residue:
384
  
Inhibitor
Name:
BDBM50065468
Synonyms:
2-(4-Chloro-phenoxymethyl)-4-(3-piperidin-1-yl-propoxy)-1-(3-piperidin-3-yl-propyl)-1H-benzoimidazole | CHEMBL61532
Type:
Small organic molecule
Emp. Form.:
C30H41ClN4O2
Mol. Mass.:
525.125
SMILES:
Clc1ccc(OCc2nc3c(OCCCN4CCCCC4)cccc3n2CCCC2CCCNC2)cc1
: