Target
Neuropeptide Y receptor type 1
Ligand
BDBM50065469
Substrate
Meas. Tech.
ChEMBL_143830 (CHEMBL748714)
Ki
4.6±n/a nM
Citation
 Zarrinmayeh, HNunes, AMOrnstein, PLZimmerman, DMArnold, MBSchober, DAGackenheimer, SLBruns, RFHipskind, PABritton, TCCantrell, BEGehlert, DR Synthesis and evaluation of a series of novel 2-[(4-chlorophenoxy)methyl]benzimidazoles as selective neuropeptide Y Y1 receptor antagonists. J Med Chem 41:2709-19 (1998)  
Target
Name:
Neuropeptide Y receptor type 1
Synonyms:
NPY-Y1 NPY1R NPYR neuropeptide Y receptor Y1
Type:
Enzyme Catalytic Domain
Mol. Mass.:
44399.07
Organism:
Homo sapiens (Human)
Description:
NPY-Y1 NPY1R HUMAN::P25929
Residue:
384
  
Inhibitor
Name:
BDBM50065469
Synonyms:
2-Diphenylacetylamino-5-guanidino-pentanoic acid 4-hydroxy-benzylamide | CHEMBL44246
Type:
Small organic molecule
Emp. Form.:
C27H31N5O3
Mol. Mass.:
473.5667
SMILES:
NC(=N)NCCCC(NC(=O)C(c1ccccc1)c1ccccc1)C(=O)NCc1ccc(O)cc1
: