Target
Neuropeptide Y receptor type 1
Ligand
BDBM50060725
Substrate
Meas. Tech.
ChEMBL_143830 (CHEMBL748714)
Ki
0.75±n/a nM
Citation
 Zarrinmayeh, HNunes, AMOrnstein, PLZimmerman, DMArnold, MBSchober, DAGackenheimer, SLBruns, RFHipskind, PABritton, TCCantrell, BEGehlert, DR Synthesis and evaluation of a series of novel 2-[(4-chlorophenoxy)methyl]benzimidazoles as selective neuropeptide Y Y1 receptor antagonists. J Med Chem 41:2709-19 (1998)  
Target
Name:
Neuropeptide Y receptor type 1
Synonyms:
NPY-Y1 NPY1R NPYR neuropeptide Y receptor Y1
Type:
Enzyme Catalytic Domain
Mol. Mass.:
44399.07
Organism:
Homo sapiens (Human)
Description:
NPY-Y1 NPY1R HUMAN::P25929
Residue:
384
  
Inhibitor
Name:
BDBM50060725
Synonyms:
2-[1,4']Bipiperidinyl-1'-yl-1-[2-(4-chloro-phenoxymethyl)-1-((S)-3-piperidin-3-yl-propyl)-1H-indol-3-yl]-ethanone | CHEMBL329536
Type:
Small organic molecule
Emp. Form.:
C35H47ClN4O2
Mol. Mass.:
591.226
SMILES:
Clc1ccc(OCc2c(C(=O)CN3CCC(CC3)N3CCCCC3)c3ccccc3n2CCC[C@@H]2CCCNC2)cc1
: