Target
Adenosine receptor A2b
Ligand
BDBM50053923
Substrate
Meas. Tech.
ChEMBL_30295 (CHEMBL875505)
IC50
2650±n/a nM
Citation
 Kim, YCde Zwart, MChang, LMoro, Svon Frijtag Drabbe Künzel, JKMelman, NIJzerman, APJacobson, KA Derivatives of the triazoloquinazoline adenosine antagonist (CGS 15943) having high potency at the human A2B and A3 receptor subtypes. J Med Chem 41:2835-45 (1998)  
Target
Name:
Adenosine receptor A2b
Synonyms:
AA2BR_HUMAN ADORA2B Adenosine receptors A2b | Adenosine receptors; A2a & A2b
Type:
G Protein-Coupled Receptor (GPCR)
Mol. Mass.:
36341.22
Organism:
Homo sapiens (Human)
Description:
Residue:
332
  
Inhibitor
Name:
BDBM50053923
Synonyms:
CHEMBL318251 N-(9-chloro-2-(furan-2-yl)-[1,2,4]triazolo[1,5-c]quinazolin-5-yl)acetamide
Type:
Small organic molecule
Emp. Form.:
C15H10ClN5O2
Mol. Mass.:
327.725
SMILES:
CC(=O)Nc1nc2ccc(Cl)cc2c2nc(nn12)-c1ccco1
: