Target
Aldehyde dehydrogenase 1A1
Ligand
BDBM50065936
Substrate
Meas. Tech.
ChEMBL_31302 (CHEMBL643983)
IC50
64300.0±n/a nM
Citation
 Conway, TTDeMaster, EGLee, MJNagasawa, HT Prodrugs of nitroxyl and nitrosobenzene as cascade latentiated inhibitors of aldehyde dehydrogenase. J Med Chem 41:2903-9 (1998)  
Target
Name:
Aldehyde dehydrogenase 1A1
Synonyms:
AL1A1_RAT Aldh1a1
Type:
PROTEIN
Mol. Mass.:
54465.59
Organism:
Rattus norvegicus
Description:
ChEMBL_31158
Residue:
501
  
Inhibitor
Name:
BDBM50065936
Synonyms:
CHEMBL98942 | N-[(ethoxycarbonyl)oxy]-N-phenylbenzenesulfonamide
Type:
Small organic molecule
Emp. Form.:
C15H15NO5S
Mol. Mass.:
321.348
SMILES:
CCOC(=O)ON(c1ccccc1)S(=O)(=O)c1ccccc1
: