Target
Endothelin-1 receptor
Ligand
BDBM50066398
Substrate
Meas. Tech.
ChEMBL_65654 (CHEMBL678074)
Ki
0.43±n/a nM
Citation
 Liu, GHenry, KJSzczepankiewicz, BGWinn, MKozmina, NSBoyd, SAWasicak, Jvon Geldern, TWWu-Wong, JRChiou, WJDixon, DBNguyen, BMarsh, KCOpgenorth, TJ Pyrrolidine-3-carboxylic acids as endothelin antagonists. 3. Discovery of a potent, 2-nonaryl, highly selective ETA antagonist (A-216546). J Med Chem 41:3261-75 (1998)  
Target
Name:
Endothelin-1 receptor
Synonyms:
EDNRA ET-A ETA-R Endothelin receptor type A hET-AR
Type:
Enzyme Catalytic Domain
Mol. Mass.:
48736.88
Organism:
Homo sapiens (Human)
Description:
P25101
Residue:
427
  
Inhibitor
Name:
BDBM50066398
Synonyms:
3-[2-(6-Methyl-benzo[1,3]dioxol-5-yl)-acetyl]-thiophene-2-sulfonic acid (4-chloro-3-methyl-isoxazol-5-yl)-amide | CHEMBL326059
Type:
Small organic molecule
Emp. Form.:
C18H15ClN2O6S2
Mol. Mass.:
454.905
SMILES:
Cc1noc(NS(=O)(=O)c2sccc2C(=O)Cc2cc3OCOc3cc2C)c1Cl
: