Target
Cathepsin B
Ligand
BDBM19807
Substrate
Meas. Tech.
ChEMBL_47585 (CHEMBL657188)
Ki
>1000±n/a nM
Citation
 Marquis, RWYamashita, DSRu, YLoCastro, SMOh, HJErhard, KFDesJarlais, RLHead, MSSmith, WWZhao, BJanson, CAAbdel-Meguid, SSTomaszek, TALevy, MAVeber, DF Conformationally constrained 1,3-diamino ketones: a series of potent inhibitors of the cysteine protease cathepsin K. J Med Chem 41:3563-7 (1998)  
Target
Name:
Cathepsin B
Synonyms:
APP secretase CATB_HUMAN CTSB Cathepsin B light chain | Cathepsin B1
Type:
Enzyme
Mol. Mass.:
37819.69
Organism:
Homo sapiens (Human)
Description:
gi_63102437
Residue:
339
  
Inhibitor
Name:
BDBM19807
Synonyms:
CHEMBL100563 pyrrolidinone analogue, 24
Type:
Small organic molecule
Emp. Form.:
C32H42N4O7
Mol. Mass.:
594.6985
SMILES:
CC(C)C[C@H](NC(=O)OCc1ccccc1)C(=O)NC1CN(CC1=O)C(=O)[C@H](CC(C)C)NC(=O)OCc1ccccc1
: