Target
ATP-citrate synthase
Ligand
BDBM50066678
Substrate
Meas. Tech.
ChEMBL_29508 (CHEMBL643074)
Ki
2900±n/a nM
Citation
 Gribble, ADIfe, RJShaw, AMcNair, DNovelli, CEBakewell, SShah, VPDolle, REGroot, PHPearce, NYates, JTew, DBoyd, HAshman, SEggleston, DSHaltiwanger, RCOkafo, G ATP-Citrate lyase as a target for hypolipidemic intervention. 2. Synthesis and evaluation of (3R,5S)-omega-substituted-3-carboxy-3, 5-dihydroxyalkanoic acids and their gamma-lactone prodrugs as inhibitors of the enzyme in vitro and in vivo. J Med Chem 41:3582-95 (1998)  
Target
Name:
ATP-citrate synthase
Synonyms:
ACLY | ACLY_HUMAN
Type:
PROTEIN
Mol. Mass.:
120848.43
Organism:
Homo sapiens (Human)
Description:
ChEMBL_455196
Residue:
1101
  
Inhibitor
Name:
BDBM50066678
Synonyms:
(S)-2-[(R)-7-(6-Chloro-1,2,3,4-tetrahydro-carbazol-9-yl)-2-hydroxy-heptyl]-2-hydroxy-succinic acid | CHEMBL121009
Type:
Small organic molecule
Emp. Form.:
C23H30ClNO6
Mol. Mass.:
451.94
SMILES:
O[C@H](CCCCCn1c2CCCCc2c2cc(Cl)ccc12)C[C@](O)(CC(O)=O)C(O)=O
: