Target
ATP-citrate synthase
Ligand
BDBM50066697
Substrate
Meas. Tech.
ChEMBL_29521 (CHEMBL640437)
Ki
2900±n/a nM
Citation
 Gribble, ADIfe, RJShaw, AMcNair, DNovelli, CEBakewell, SShah, VPDolle, REGroot, PHPearce, NYates, JTew, DBoyd, HAshman, SEggleston, DSHaltiwanger, RCOkafo, G ATP-Citrate lyase as a target for hypolipidemic intervention. 2. Synthesis and evaluation of (3R,5S)-omega-substituted-3-carboxy-3, 5-dihydroxyalkanoic acids and their gamma-lactone prodrugs as inhibitors of the enzyme in vitro and in vivo. J Med Chem 41:3582-95 (1998)  
Target
Name:
ATP-citrate synthase
Synonyms:
ACLY_RAT | Acly
Type:
PROTEIN
Mol. Mass.:
120645.65
Organism:
Rattus norvegicus
Description:
ChEMBL_857791
Residue:
1100
  
Inhibitor
Name:
BDBM50066697
Synonyms:
(S)-2-[8-(2,4-Dichloro-phenyl)-octyl]-2-hydroxy-succinic acid | CHEMBL120425
Type:
Small organic molecule
Emp. Form.:
C18H24Cl2O5
Mol. Mass.:
391.286
SMILES:
OC(=O)C[C@@](O)(CCCCCCCCc1ccc(Cl)cc1Cl)C(O)=O
: