Target
ATP-citrate synthase
Ligand
BDBM50066700
Substrate
Meas. Tech.
ChEMBL_29508 (CHEMBL643074)
Ki
5100±n/a nM
Citation
 Gribble, ADIfe, RJShaw, AMcNair, DNovelli, CEBakewell, SShah, VPDolle, REGroot, PHPearce, NYates, JTew, DBoyd, HAshman, SEggleston, DSHaltiwanger, RCOkafo, G ATP-Citrate lyase as a target for hypolipidemic intervention. 2. Synthesis and evaluation of (3R,5S)-omega-substituted-3-carboxy-3, 5-dihydroxyalkanoic acids and their gamma-lactone prodrugs as inhibitors of the enzyme in vitro and in vivo. J Med Chem 41:3582-95 (1998)  
Target
Name:
ATP-citrate synthase
Synonyms:
ACLY | ACLY_HUMAN
Type:
PROTEIN
Mol. Mass.:
120848.43
Organism:
Homo sapiens (Human)
Description:
ChEMBL_455196
Residue:
1101
  
Inhibitor
Name:
BDBM50066700
Synonyms:
(S)-2-[(R)-8-(5-Chloro-4'-methoxy-biphenyl-2-yl)-2-hydroxy-octyl]-2-hydroxy-succinic acid | CHEMBL119643
Type:
Small organic molecule
Emp. Form.:
C25H31ClO7
Mol. Mass.:
478.962
SMILES:
COc1ccc(cc1)-c1cc(Cl)ccc1CCCCCC[C@@H](O)C[C@](O)(CC(O)=O)C(O)=O
: