Target
Transient receptor potential cation channel subfamily A member 1
Ligand
BDBM50164168
Substrate
Meas. Tech.
ChEMBL_1846748 (CHEMBL4347289)
EC50
261000±n/a nM
Citation
 Chandrabalan, AMcPhillie, MJMorice, AHBoa, ANSadofsky, LR N-Cinnamoylanthranilates as human TRPA1 modulators: Structure-activity relationships and channel binding sites. Eur J Med Chem 170:141-156 (2019)  
Target
Name:
Transient receptor potential cation channel subfamily A member 1
Synonyms:
ANKTM1 TRPA1 Transformation-sensitive protein p120 | Transient receptor potential cation channel subfamily A member 1 (TRPA1)
Type:
Protein
Mol. Mass.:
127514.20
Organism:
Homo sapiens (Human)
Description:
O75762
Residue:
1119
  
Inhibitor
Name:
BDBM50164168
Synonyms:
1,3,4-Eugenol 1-Hydroxy-2-methoxy-4-prop-2-enylbenzene 1-allyl-3-methoxy-4-hydroxybenzene 2-Hydroxy-5-allylanisole 2-Methoxy-4-allylphenol 2-methoxy-4-(prop-2-en-1-yl)phenol4-allyl-2-methoxyphenol 4-Allylcatechol-2-methyl ether 4-Hydroxy-3-methoxy-1-allylbenzene CHEMBL42710 Eugenic acid p-Allylguaiacol | p-Eugenol
Type:
Small organic molecule
Emp. Form.:
C10H12O2
Mol. Mass.:
164.2011
SMILES:
COc1cc(CC=C)ccc1O
: