Target
Adenosine receptor A3
Ligand
BDBM50067074
Substrate
Meas. Tech.
ChEMBL_31999 (CHEMBL646596)
Ki
2600000±n/a nM
Citation
 van Muijlwijk-Koezen, JETimmerman, HLink, Rvan der Goot, HIJzerman, AP A novel class of adenosine A3 receptor ligands. 1. 3-(2-Pyridinyl)isoquinoline derivatives. J Med Chem 41:3987-93 (1998)  
Target
Name:
Adenosine receptor A3
Synonyms:
A3 adenosine receptor (hA3) ADORA3 | Adenosine A3 receptor (A3AR)
Type:
G Protein-Coupled Receptor (GPCR)
Mol. Mass.:
36197.32
Organism:
Homo sapiens (Human)
Description:
P0DMS8
Residue:
318
  
Inhibitor
Name:
BDBM50067074
Synonyms:
1-Chloro-3-pyridin-2-yl-isoquinoline | CHEMBL128517
Type:
Small organic molecule
Emp. Form.:
C14H9ClN2
Mol. Mass.:
240.688
SMILES:
Clc1nc(cc2ccccc12)-c1ccccn1
: