Target
Adenosine receptor A1
Ligand
BDBM50067078
Substrate
Meas. Tech.
ChEMBL_29471 (CHEMBL642200)
Ki
3300000±n/a nM
Citation
 van Muijlwijk-Koezen, JETimmerman, HLink, Rvan der Goot, HIJzerman, AP A novel class of adenosine A3 receptor ligands. 1. 3-(2-Pyridinyl)isoquinoline derivatives. J Med Chem 41:3987-93 (1998)  
Target
Name:
Adenosine receptor A1
Synonyms:
AA1R_RAT ADENOSINE A1 high Adenosine A1 receptor (A1) Adenosine receptors A1 | Adora1
Type:
Protein
Mol. Mass.:
36704.13
Organism:
Rattus norvegicus (rat)
Description:
Residue:
326
  
Inhibitor
Name:
BDBM50067078
Synonyms:
1-Methoxy-3-pyridin-2-yl-isoquinoline | CHEMBL340231
Type:
Small organic molecule
Emp. Form.:
C15H12N2O
Mol. Mass.:
236.2686
SMILES:
COc1nc(cc2ccccc12)-c1ccccn1
: