Target
Adenosine receptor A3
Ligand
BDBM50067098
Substrate
Meas. Tech.
ChEMBL_31996 (CHEMBL646593)
Ki
310000±n/a nM
Citation
 van Muijlwijk-Koezen, JETimmerman, HLink, Rvan der Goot, HIjzerman, AP A novel class of adenosine A3 receptor ligands. 2. Structure affinity profile of a series of isoquinoline and quinazoline compounds. J Med Chem 41:3994-4000 (1998)  
Target
Name:
Adenosine receptor A3
Synonyms:
A3 adenosine receptor (hA3) ADORA3 | Adenosine A3 receptor (A3AR)
Type:
G Protein-Coupled Receptor (GPCR)
Mol. Mass.:
36197.32
Organism:
Homo sapiens (Human)
Description:
P0DMS8
Residue:
318
  
Inhibitor
Name:
BDBM50067098
Synonyms:
3,4-Dimethoxy-N-(3-pyridin-2-yl-isoquinolin-1-yl)-benzamide CHEMBL130130
Type:
Small organic molecule
Emp. Form.:
C23H19N3O3
Mol. Mass.:
385.4153
SMILES:
COc1ccc(cc1OC)C(=O)Nc1nc(cc2ccccc12)-c1ccccn1
: