Target
Histone-lysine N-methyltransferase EHMT1
Ligand
BDBM50446376
Substrate
Meas. Tech.
ChEMBL_1849742 (CHEMBL4350283)
IC50
11±n/a nM
Citation
 Leenders, RZijlmans, Rvan Bree, Bvan de Sande, MTrivarelli, FDamen, EWegert, AMüller, DEhlert, JEFeger, DHeidemann-Dinger, CKubbutat, MSchächtele, CLenstra, DCMecinovi?, JMüller, G Novel SAR for quinazoline inhibitors of EHMT1 and EHMT2. Bioorg Med Chem Lett 29:2516-2524 (2019)  
Target
Name:
Histone-lysine N-methyltransferase EHMT1
Synonyms:
EHMT1 EUHMTASE1 Euchromatic histone-lysine N-methyltransferase 1 GLP H3-K9-HMTase 5 Histone-lysine N-methyltransferase EHMT1/EHMT2 KMT1D | Lysine N-methyltransferase 1D
Type:
PROTEIN
Mol. Mass.:
141443.67
Organism:
Homo sapiens (Human)
Description:
ChEMBL_1450367
Residue:
1298
  
Inhibitor
Name:
BDBM50446376
Synonyms:
CHEMBL3109630
Type:
Small organic molecule
Emp. Form.:
C19H27N3O2
Mol. Mass.:
329.4366
SMILES:
COc1cc2c(cc1OCCCN1CCCC1)N=C(N)C21CCC1
: