Target
Prothrombin
Ligand
BDBM50067797
Substrate
Meas. Tech.
ChEMBL_208516 (CHEMBL817242)
Ki
0.8±n/a nM
Citation
 Sanderson, PELyle, TACutrona, KJDyer, DLDorsey, BDMcDonough, CMNaylor-Olsen, AMChen, IWChen, ZCook, JJCooper, CMGardell, SJHare, TRKrueger, JALewis, SDLin, JHLucas, BJLyle, EALynch, JJStranieri, MTVastag, KYan, YShafer, JAVacca, JP Efficacious, orally bioavailable thrombin inhibitors based on 3-aminopyridinone or 3-aminopyrazinone acetamide peptidomimetic templates. J Med Chem 41:4466-74 (1998)  
Target
Name:
Prothrombin
Synonyms:
Activation peptide fragment 1 Coagulation factor II Prothrombin precursor Thrombin heavy chain | Thrombin light chain
Type:
Protein
Mol. Mass.:
70029.57
Organism:
Homo sapiens (Human)
Description:
P00734
Residue:
622
  
Inhibitor
Name:
BDBM50067797
Synonyms:
CHEMBL19080 N-(6-Amino-2-methyl-pyridin-3-ylmethyl)-2-(6-methyl-2-oxo-3-phenethylamino-2H-pyrazin-1-yl)-acetamide | US11584714, Compound 1488
Type:
Small organic molecule
Emp. Form.:
C22H26N6O2
Mol. Mass.:
406.4808
SMILES:
Cc1nc(N)ccc1CNC(=O)Cn1c(C)cnc(NCCc2ccccc2)c1=O
: