Target
MAP kinase-interacting serine/threonine-protein kinase 1
Ligand
BDBM168281
Substrate
Meas. Tech.
ChEMBL_1849886 (CHEMBL4350427)
IC50
4.0±n/a nM
Citation
 Abdelaziz, AMBasnet, SKCIslam, SLi, MTadesse, SAlbrecht, HGerber, CYu, MWang, S Synthesis and evaluation of 2'H-spiro[cyclohexane-1,3'-imidazo[1,5-a]pyridine]-1',5'-dione derivatives as Mnk inhibitors. Bioorg Med Chem Lett 29:2650-2654 (2019)  
Target
Name:
MAP kinase-interacting serine/threonine-protein kinase 1
Synonyms:
MAP Kinase-Interacting Protein Kinase (MNK1) MAP kinase-interacting serine/threonine-protein kinase 1 (MnK1) MAP-kinase interacting kinase 1 (MNK1) MKNK1 MNK1
Type:
Serine/threonine-protein kinase
Mol. Mass.:
51342.85
Organism:
Homo sapiens (Human)
Description:
Q9BUB5
Residue:
465
  
Inhibitor
Name:
BDBM168281
Synonyms:
US9669031, 109 8-chloro-6-(pyrimidin-4-ylamino)spiro[2H-imidazo[1,5-a]pyridine-3,1′-cyclohexane]-1,5-dione hydrochloride (Cpd. No. 109)
Type:
Small organic molecule
Emp. Form.:
C16H16ClN5O2
Mol. Mass.:
345.784
SMILES:
Clc1cc(Nc2ccncn2)c(=O)n2c1C(=O)NC21CCCCC1
: