Target
Prostaglandin G/H synthase 1
Ligand
BDBM50068169
Substrate
Meas. Tech.
ChEMBL_159274 (CHEMBL764258)
IC50
>40000±n/a nM
Citation
 Kalgutkar, ASKozak, KRCrews, BCHochgesang, GPMarnett, LJ Covalent modification of cyclooxygenase-2 (COX-2) by 2-acetoxyphenyl alkyl sulfides, a new class of selective COX-2 inactivators. J Med Chem 41:4800-18 (1998)  
Target
Name:
Prostaglandin G/H synthase 1
Synonyms:
COX1 Cyclooxygenase-1 (COX-1) PTGS1 | Prostaglandin G/H synthase (cyclooxygenase)
Type:
Protein
Mol. Mass.:
68868.60
Organism:
Ovis aries (Sheep)
Description:
Residue:
600
  
Inhibitor
Name:
BDBM50068169
Synonyms:
Acetic acid 2-cyclohexylsulfanyl-phenyl ester | CHEMBL356093
Type:
Small organic molecule
Emp. Form.:
C14H18O2S
Mol. Mass.:
250.357
SMILES:
CC(=O)Oc1ccccc1SC1CCCCC1
: