Target
D(4) dopamine receptor
Ligand
BDBM50033858
Substrate
Meas. Tech.
ChEMBL_63088 (CHEMBL676184)
IC50
280±n/a nM
Citation
 Perrone, RBerardi, FColabufo, NALeopoldo, MTortorella, V N-[2-[4-(4-Chlorophenyl)piperazin-1-yl]ethyl]-3-methoxybenzamide: a potent and selective dopamine D4 ligand. J Med Chem 41:4903-9 (1998)  
Target
Name:
D(4) dopamine receptor
Synonyms:
D(2C) dopamine receptor DOPAMINE D4.2 DRD4 Dopamine D4 receptor
Type:
Enzyme
Mol. Mass.:
48373.19
Organism:
Homo sapiens (Human)
Description:
P21917
Residue:
419
  
Inhibitor
Name:
BDBM50033858
Synonyms:
1-(2-Methoxy-phenyl)-4-[3-(7-methoxy-1,2,3,4-tetrahydro-naphthalen-1-yl)-propyl]-piperazine | CHEMBL424125
Type:
Small organic molecule
Emp. Form.:
C25H34N2O2
Mol. Mass.:
394.5497
SMILES:
COc1ccc2CCCC(CCCN3CCN(CC3)c3ccccc3OC)c2c1
: