Target
Gag-Pol polyprotein [489-587]
Ligand
BDBM161
Substrate
Meas. Tech.
ChEMBL_80093 (CHEMBL687817)
Ki
0.018000±n/a nM
Citation
 Rodgers, JDJohnson, BLWang, HErickson-Viitanen, SKlabe, RMBacheler, LCordova, BCChang, CH Potent cyclic urea HIV protease inhibitors with 3-aminoindazole P2/P2' groups. Bioorg Med Chem Lett 8:715-20 (1999)  
Target
Name:
Gag-Pol polyprotein [489-587]
Synonyms:
Human immunodeficiency virus type 1 protease Pol polyprotein | gag-pol
Type:
Enzyme Subunit
Mol. Mass.:
10781.16
Organism:
Human immunodeficiency virus type 1
Description:
P04585[489-587]
Residue:
99
  
Inhibitor
Name:
BDBM161
Synonyms:
(4R,5S,6S,7R)-4,7-dibenzyl-5,6-dihydroxy-1,3-bis(1H-indazol-5-ylmethyl)-1,3-diazepan-2-one Cyclic Urea | Indazole, 1
Type:
Emp. Form.:
C35H34N6O3
Mol. Mass.:
586.6829
SMILES:
O[C@@H]1[C@@H](O)[C@@H](Cc2ccccc2)N(Cc2ccc3[nH]ncc3c2)C(=O)N(Cc2ccc3[nH]ncc3c2)[C@@H]1Cc1ccccc1
: