Target
D(4) dopamine receptor
Ligand
BDBM50069038
Substrate
Meas. Tech.
ChEBML_58935
Ki
3.8±n/a nM
Citation
 Sanner, MAChappie, TADunaiskis, ARFliri, AFDesai, KAZorn, SHJackson, ERJohnson, CGMorrone, JMSeymour, PAMajchrzak, MJFaraci, WSCollins, JLDuignan, DBPrete Di, CCLee, JSTrozzi, A Synthesis, SAR and pharmacology of CP-293,019: a potent, selective dopamine D4 receptor antagonist. Bioorg Med Chem Lett 8:725-30 (1999)  
Target
Name:
D(4) dopamine receptor
Synonyms:
D(2C) dopamine receptor DOPAMINE D4.2 DRD4 Dopamine D4 receptor
Type:
Enzyme
Mol. Mass.:
48373.19
Organism:
Homo sapiens (Human)
Description:
P21917
Residue:
419
  
Inhibitor
Name:
BDBM50069038
Synonyms:
7-Phenoxymethyl-2-pyrimidin-2-yl-octahydro-pyrido[1,2-a]pyrazine | CHEMBL162265
Type:
Small organic molecule
Emp. Form.:
C19H24N4O
Mol. Mass.:
324.4201
SMILES:
C(Oc1ccccc1)C1CCC2CN(CCN2C1)c1ncccn1
: