Target
Prothrombin
Ligand
BDBM50069292
Substrate
Meas. Tech.
ChEBML_210590
Ki
4±n/a nM
Citation
 Oh, YSYun, MHwang, SYHong, SShin, YLee, KYoon, KHYoo, YJKim, DSLee, SHLee, YHPark, HDLee, CHLee, SKKim, S Discovery of LB30057, a benzamidrazone-based selective oral thrombin inhibitor. Bioorg Med Chem Lett 8:631-4 (1999)  
Target
Name:
Prothrombin
Synonyms:
Activation peptide fragment 1 Coagulation factor II Prothrombin Thrombin Thrombin light chain
Type:
Enzyme
Mol. Mass.:
70502.73
Organism:
Bos taurus (Bovine)
Description:
P00735
Residue:
625
  
Inhibitor
Name:
BDBM50069292
Synonyms:
CHEMBL156082 | N-ethyl-N-cyclopentyl-3-(4-hydrazonoformamidephenyl)-2-[(2-naphthylsulfonyl)amino]propanamide
Type:
Small organic molecule
Emp. Form.:
C27H33N5O3S
Mol. Mass.:
507.648
SMILES:
CCN(C1CCCC1)C(=O)[C@H](Cc1ccc(cc1)C(N)=NN)NS(=O)(=O)c1ccc2ccccc2c1
: