Target
5-hydroxytryptamine receptor 1A
Ligand
BDBM50033383
Substrate
Meas. Tech.
ChEBML_950
Ki
124±n/a nM
Citation
 Perez, MPauwels, PJFourrier, CChopin, PValentin, JPJohn, GWMarien, MHalazy, S Dimerization of sumatriptan as an efficient way to design a potent, centrally and orally active 5-HT1B agonist. Bioorg Med Chem Lett 8:675-80 (1999)  
Target
Name:
5-hydroxytryptamine receptor 1A
Synonyms:
5-HT-1A 5-hydroxytryptamine receptor 1A (5-HT-1A) ADRB2RL1 Dopamine D2 receptor and serotonin 1a receptor HTR1A | Serotonin receptor 1A
Type:
Mol. Mass.:
46122.49
Organism:
Homo sapiens (Human)
Description:
Residue:
422
  
Inhibitor
Name:
BDBM50033383
Synonyms:
(S)-4-((3-(2-(dimethylamino)ethyl)-1H-indol-5-yl)methyl)oxazolidin-2-one 311C90 ZOLMITRIPTAN ZOMIG-ZMT
Type:
Small organic molecule
Emp. Form.:
C16H21N3O2
Mol. Mass.:
287.3568
SMILES:
CN(C)CCc1c[nH]c2ccc(C[C@H]3COC(=O)N3)cc12
: