Target
D(2) dopamine receptor
Ligand
BDBM50069907
Substrate
Meas. Tech.
ChEMBL_58480 (CHEMBL670411)
Ki
95.1±n/a nM
Citation
 Mewshaw, REHusbands, MGildersleeve, ESWebb, MBShi, XMazandarani, HCockett, MIOchalski, RBrennan, JAAbou-Gharbia, MMarquis, KMcGaughey, GBCoupet, JAndree, TH New generation dopaminergic agents. 2. Discovery of 3-OH-phenoxyethylamine and 3-OH-N1-phenylpiperazine dopaminergic templates. Bioorg Med Chem Lett 8:295-300 (1999)  
Target
Name:
D(2) dopamine receptor
Synonyms:
DOPAMINE D2 DOPAMINE D2 Short Dopamine D2 receptor Drd2
Type:
G Protein-Coupled Receptor (GPCR)
Mol. Mass.:
50931.60
Organism:
Rattus norvegicus (rat)
Description:
P61169
Residue:
444
  
Inhibitor
Name:
BDBM50069907
Synonyms:
1-benzyl-4-(3-hydroxyphenyl)piperazine CHEMBL88365
Type:
Small organic molecule
Emp. Form.:
C17H20N2O
Mol. Mass.:
268.3535
SMILES:
Oc1cccc(c1)N1CCN(Cc2ccccc2)CC1
: