Target
Nonstructural protein 5A
Ligand
BDBM50387084
Substrate
Meas. Tech.
ChEMBL_1858471 (CHEMBL4359200)
EC50
52.8±n/a nM
Citation
 Kazmierski, WMBaskaran, SWalker, JTMiriyala, NMeesala, RBeesu, MAdjabeng, GGrimes, RMHamatake, RLeivers, MRCrosby, RXia, BRemlinger, K GSK2818713, a Novel Biphenylene Scaffold-Based Hepatitis C NS5A Replication Complex Inhibitor with Broad Genotype Coverage. J Med Chem 63:4155-4170 (2020)  
Target
Name:
Nonstructural protein 5A
Synonyms:
NS5A | Nonstructural protein 5A
Type:
PROTEIN
Mol. Mass.:
48587.20
Organism:
Hepatitis C virus
Description:
ChEMBL_108438
Residue:
447
  
Inhibitor
Name:
BDBM50387084
Synonyms:
BMS-790052 | DACLATASVIR
Type:
Small organic molecule
Emp. Form.:
C40H50N8O6
Mol. Mass.:
738.875
SMILES:
COC(=O)N[C@@H](C(C)C)C(=O)N1CCC[C@H]1c1nc(c[nH]1)-c1ccc(cc1)-c1ccc(cc1)-c1c[nH]c(n1)[C@@H]1CCCN1C(=O)[C@@H](NC(=O)OC)C(C)C
: