Target
Beta-3 adrenergic receptor
Ligand
BDBM50070176
Substrate
Meas. Tech.
ChEBML_38911
EC50
10±n/a nM
Citation
 Parmee, EROk, HOCandelore, MRTota, LDeng, LStrader, CDWyvratt, MJFisher, MHWeber, AE Discovery of L-755,507: a subnanomolar human beta 3 adrenergic receptor agonist. Bioorg Med Chem Lett 8:1107-12 (1999)  
Target
Name:
Beta-3 adrenergic receptor
Synonyms:
ADRB3 ADRB3_HUMAN Beta-2 adrenergic receptor and beta-3 adrenergic receptor Beta-3 adrenoreceptor | adrenergic Beta3
Type:
G Protein-Coupled Receptor (GPCR)
Mol. Mass.:
43534.88
Organism:
Homo sapiens (Human)
Description:
Residue:
408
  
Inhibitor
Name:
BDBM50070176
Synonyms:
4-(3-Hexyl-1,3-dimethyl-ureido)-N-(4-{2-[(S)-2-hydroxy-3-(4-hydroxy-phenoxy)-propylamino]-ethyl}-phenyl)-benzenesulfonamide | CHEMBL275114
Type:
Small organic molecule
Emp. Form.:
C32H44N4O6S
Mol. Mass.:
612.78
SMILES:
CCCCCCN(C)C(=O)N(C)c1ccc(cc1)S(=O)(=O)Nc1ccc(CCNC[C@H](O)COc2ccc(O)cc2)cc1
: