Target
Matrix metalloproteinase-9
Ligand
BDBM50070256
Substrate
Meas. Tech.
ChEBML_105236
IC50
0.140000±n/a nM
Citation
 Levin, JIDiJoseph, JFKillar, LMSharr, MASkotnicki, JSPatel, DVXiao, XYShi, LNavre, MCampbell, DA The asymmetric synthesis and in vitro characterization of succinyl mercaptoalcohol and mercaptoketone inhibitors of matrix metalloproteinases. Bioorg Med Chem Lett 8:1163-8 (1999)  
Target
Name:
Matrix metalloproteinase-9
Synonyms:
67 kDa matrix metalloproteinase-9 92 kDa gelatinase CLG4B Gelatinase B MMP9 Matrix metalloproteinase 9 (MMP-9) Matrix metalloproteinase-9 (MMP9)
Type:
Enzyme
Mol. Mass.:
78452.28
Organism:
Homo sapiens (Human)
Description:
P14780
Residue:
707
  
Inhibitor
Name:
BDBM50070256
Synonyms:
(R)-2-((S)-2-Hydroxy-3-mercapto-propyl)-nonanoic acid ((S)-2,2-dimethyl-1-methylcarbamoyl-propyl)-amide | CHEMBL16519
Type:
Small organic molecule
Emp. Form.:
C19H38N2O3S
Mol. Mass.:
374.582
SMILES:
CCCCCCC[C@H](C[C@H](O)CS)C(=O)N[C@H](C(=O)NC)C(C)(C)C
: