Target
Gag-Pol polyprotein [489-587]
Ligand
BDBM767
Substrate
Meas. Tech.
ChEMBL_157555 (CHEMBL763307)
Ki
<1±n/a nM
Citation
 Janakiraman, MNWatenpaugh, KDTomich, PKChong, KTTurner, SRTommasi, RAThaisrivongs, SStrohbach, JW Non-peptidic HIV protease inhibitors: C2-symmetry-based design of bis-sulfonamide dihydropyrones. Bioorg Med Chem Lett 8:1237-42 (1999)  
Target
Name:
Gag-Pol polyprotein [489-587]
Synonyms:
Human immunodeficiency virus type 1 protease Pol polyprotein | gag-pol
Type:
Enzyme Subunit
Mol. Mass.:
10781.16
Organism:
Human immunodeficiency virus type 1
Description:
P04585[489-587]
Residue:
99
  
Inhibitor
Name:
BDBM767
Synonyms:
4-Cyano-N-[3-[cyclopropyl(5,6,7,8,9,10-hexahydro-4-hydroxy-2-oxo-2H-cycloocta[b]pyran-3-yl)methyl]phenyl]-benzenesulfonamide U-103,017
Type:
Small organic molecule
Emp. Form.:
C28H28N2O5S
Mol. Mass.:
504.597
SMILES:
Oc1c2CCCCCCc2oc(=O)c1[C@@H](C1CC1)c1cccc(NS(=O)(=O)c2ccc(cc2)C#N)c1
: