Target
Chymotrypsin-like elastase family member 2A
Ligand
BDBM50070434
Substrate
Meas. Tech.
ChEBML_158077
IC50
>75000±n/a nM
Citation
 Déziel, RMalenfant, E Inhibition of human cytomegalovirus protease N(o) with monocyclic beta-lactams. Bioorg Med Chem Lett 8:1437-42 (1999)  
Target
Name:
Chymotrypsin-like elastase family member 2A
Synonyms:
CEL2A_PIG ELA2 Elastase 2A Elastase-2A | Pancreatic elastase
Type:
PROTEIN
Mol. Mass.:
28705.23
Organism:
Sus scrofa
Description:
ChEMBL_156951
Residue:
269
  
Inhibitor
Name:
BDBM50070434
Synonyms:
CHEMBL288793 | {4-[4-Oxo-1-((R)-1-phenyl-ethylcarbamoyl)-azetidin-2-ylsulfanylmethyl]-phenyl}-acetic acid tert-butyl ester
Type:
Small organic molecule
Emp. Form.:
C25H30N2O4S
Mol. Mass.:
454.582
SMILES:
C[C@@H](NC(=O)N1C(CC1=O)SCc1ccc(CC(=O)OC(C)(C)C)cc1)c1ccccc1
: