Target
Cathepsin B
Ligand
BDBM50070443
Substrate
Meas. Tech.
ChEBML_47606
IC50
>75000±n/a nM
Citation
 Déziel, RMalenfant, E Inhibition of human cytomegalovirus protease N(o) with monocyclic beta-lactams. Bioorg Med Chem Lett 8:1437-42 (1999)  
Target
Name:
Cathepsin B
Synonyms:
APP secretase CATB_HUMAN CTSB Cathepsin B light chain | Cathepsin B1
Type:
Enzyme
Mol. Mass.:
37819.69
Organism:
Homo sapiens (Human)
Description:
gi_63102437
Residue:
339
  
Inhibitor
Name:
BDBM50070443
Synonyms:
((S)-2,2-Dimethyl-1-{(S)-3-methyl-1-[4-oxo-1-((R)-1-phenyl-ethylcarbamoyl)-azetidin-2-yloxymethyl]-butylcarbamoyl}-propyl)-carbamic acid tert-butyl ester | CHEMBL285920
Type:
Small organic molecule
Emp. Form.:
C29H46N4O6
Mol. Mass.:
546.6987
SMILES:
CC(C)C[C@@H](COC1CC(=O)N1C(=O)N[C@H](C)c1ccccc1)NC(=O)[C@@H](NC(=O)OC(C)(C)C)C(C)(C)C
: