Target
Capsid scaffolding protein
Ligand
BDBM50070448
Substrate
Meas. Tech.
ChEBML_158971
IC50
2400±n/a nM
Citation
 Déziel, RMalenfant, E Inhibition of human cytomegalovirus protease N(o) with monocyclic beta-lactams. Bioorg Med Chem Lett 8:1437-42 (1999)  
Target
Name:
Capsid scaffolding protein
Synonyms:
APNG Assembly protein Human cytomegalovirus protease (HCMV Pr) Protease precursor UL80 | pPR
Type:
PROTEIN
Mol. Mass.:
73854.16
Organism:
Human cytomegalovirus (strain AD169) (HHV-5) (Human herpesvirus 5)
Description:
ChEMBL_158958
Residue:
708
  
Inhibitor
Name:
BDBM50070448
Synonyms:
2-Benzylsulfanyl-4-oxo-azetidine-1-carboxylic acid ((R)-1-phenyl-ethyl)-amide | CHEMBL32918
Type:
Small organic molecule
Emp. Form.:
C19H20N2O2S
Mol. Mass.:
340.439
SMILES:
C[C@@H](NC(=O)N1C(CC1=O)SCc1ccccc1)c1ccccc1
: