Target
Chymotrypsinogen B
Ligand
BDBM50070445
Substrate
Meas. Tech.
ChEBML_216648
IC50
>75000±n/a nM
Citation
 Déziel, RMalenfant, E Inhibition of human cytomegalovirus protease N(o) with monocyclic beta-lactams. Bioorg Med Chem Lett 8:1437-42 (1999)  
Target
Name:
Chymotrypsinogen B
Synonyms:
Beta-chymotrypsin CTRB1 Chymotrypsin B chain A Chymotrypsin B chain C Synonyms=CTRB
Type:
PROTEIN
Mol. Mass.:
27713.98
Organism:
Homo sapiens (Human)
Description:
ChEMBL_10909
Residue:
263
  
Inhibitor
Name:
BDBM50070445
Synonyms:
2-Oxo-4-(pyridin-2-ylmethylsulfanyl)-azetidine-1-carboxylic acid ((R)-1-phenyl-ethyl)-amide | CHEMBL287467
Type:
Small organic molecule
Emp. Form.:
C18H19N3O2S
Mol. Mass.:
341.427
SMILES:
C[C@@H](NC(=O)N1C(CC1=O)SCc1ccccn1)c1ccccc1
: