Target
Neutrophil elastase
Ligand
BDBM50070448
Substrate
Meas. Tech.
ChEBML_63670
IC50
>75000±n/a nM
Citation
 Déziel, RMalenfant, E Inhibition of human cytomegalovirus protease N(o) with monocyclic beta-lactams. Bioorg Med Chem Lett 8:1437-42 (1999)  
Target
Name:
Neutrophil elastase
Synonyms:
Bone marrow serine protease Coagulation factor X ELANE Elastase HLE Leukocyte elastase Medullasin Neutrophil elastase (HNE) PMN elastase Trypsin
Type:
Enzyme
Mol. Mass.:
28532.38
Organism:
Homo sapiens (Human)
Description:
P08246
Residue:
267
  
Inhibitor
Name:
BDBM50070448
Synonyms:
2-Benzylsulfanyl-4-oxo-azetidine-1-carboxylic acid ((R)-1-phenyl-ethyl)-amide | CHEMBL32918
Type:
Small organic molecule
Emp. Form.:
C19H20N2O2S
Mol. Mass.:
340.439
SMILES:
C[C@@H](NC(=O)N1C(CC1=O)SCc1ccccc1)c1ccccc1
: