Target
Cathepsin B
Ligand
BDBM50070442
Substrate
Meas. Tech.
ChEBML_47606
IC50
>75000±n/a nM
Citation
 Déziel, RMalenfant, E Inhibition of human cytomegalovirus protease N(o) with monocyclic beta-lactams. Bioorg Med Chem Lett 8:1437-42 (1999)  
Target
Name:
Cathepsin B
Synonyms:
APP secretase CATB_HUMAN CTSB Cathepsin B light chain | Cathepsin B1
Type:
Enzyme
Mol. Mass.:
37819.69
Organism:
Homo sapiens (Human)
Description:
gi_63102437
Residue:
339
  
Inhibitor
Name:
BDBM50070442
Synonyms:
CHEMBL263736 | {(S)-1-[(S)-1-(1-Benzylcarbamoyl-4-oxo-azetidin-2-yloxymethyl)-3-methyl-butylcarbamoyl]-2,2-dimethyl-propyl}-carbamic acid tert-butyl ester
Type:
Small organic molecule
Emp. Form.:
C28H44N4O6
Mol. Mass.:
532.6722
SMILES:
CC(C)C[C@@H](COC1CC(=O)N1C(=O)NCc1ccccc1)NC(=O)[C@@H](NC(=O)OC(C)(C)C)C(C)(C)C
: