Target
Neutrophil elastase
Ligand
BDBM50070436
Substrate
Meas. Tech.
ChEBML_63670
IC50
>75000±n/a nM
Citation
 Déziel, RMalenfant, E Inhibition of human cytomegalovirus protease N(o) with monocyclic beta-lactams. Bioorg Med Chem Lett 8:1437-42 (1999)  
Target
Name:
Neutrophil elastase
Synonyms:
Bone marrow serine protease Coagulation factor X ELANE Elastase HLE Leukocyte elastase Medullasin Neutrophil elastase (HNE) PMN elastase Trypsin
Type:
Enzyme
Mol. Mass.:
28532.38
Organism:
Homo sapiens (Human)
Description:
P08246
Residue:
267
  
Inhibitor
Name:
BDBM50070436
Synonyms:
2-Oxo-4-(pyridin-2-ylmethylsulfanyl)-azetidine-1-carboxylic acid (2-benzyloxy-ethyl)-amide | CHEMBL36010
Type:
Small organic molecule
Emp. Form.:
C19H21N3O3S
Mol. Mass.:
371.453
SMILES:
O=C(NCCOCc1ccccc1)N1C(CC1=O)SCc1ccccn1
: