Target
Reverse transcriptase/RNaseH
Ligand
BDBM2716
Substrate
Meas. Tech.
ChEMBL_195077 (CHEMBL797531)
IC50
25±n/a nM
Citation
 Sahlberg, CNoréen, REngelhardt, PHögberg, MKangasmetsä, JVrang, LZhang, H Synthesis and anti-HIV activities of urea-PETT analogs belonging to a new class of potent non-nucleoside HIV-1 reverse transcriptase inhibitors. Bioorg Med Chem Lett 8:1511-6 (1999)  
Target
Name:
Reverse transcriptase/RNaseH
Synonyms:
HIV-1 Reverse Transcriptase RNase H Reverse transcriptase/RNaseH
Type:
PROTEIN
Mol. Mass.:
65229.15
Organism:
Human immunodeficiency virus 1
Description:
ChEMBL_1473730
Residue:
566
  
Inhibitor
Name:
BDBM2716
Synonyms:
1-(5-bromopyridin-2-yl)-3-{2-[3-(dimethylamino)-2,6-difluorophenyl]ethyl}urea N-[2-(2,6-Difluoro-3-(dimethylamino)phenethyl)]-N-[2-(5-bromopyridyl)]urea | urea-PETT deriv. 1
Type:
Small organic molecule
Emp. Form.:
C16H17BrF2N4O
Mol. Mass.:
399.233
SMILES:
CN(C)c1ccc(F)c(CCNC(=O)Nc2ccc(Br)cn2)c1F
: