Target
Tyrosine-protein kinase Fyn
Ligand
BDBM50515526
Substrate
Meas. Tech.
ChEMBL_1861461 (CHEMBL4362317)
Ki
120±n/a nM
Citation
 Fallacara, ALPassannanti, RMori, MIovenitti, GMusumeci, FGreco, CCrespan, EKissova, MMaga, GTarantelli, CSpriano, FGaudio, EBertoni, FBotta, MSchenone, S Identification of a new family of pyrazolo[3,4-d]pyrimidine derivatives as multitarget Fyn-Blk-Lyn inhibitors active on B- and T-lymphoma cell lines. Eur J Med Chem 181:0 (2019)  
Target
Name:
Tyrosine-protein kinase Fyn
Synonyms:
FYN Proto-oncogene Syn SLK Src-like kinase | p59-Fyn
Type:
Enzyme
Mol. Mass.:
60762.21
Organism:
Homo sapiens (Human)
Description:
P06241
Residue:
537
  
Inhibitor
Name:
BDBM50515526
Synonyms:
CHEMBL4452230
Type:
Small organic molecule
Emp. Form.:
C20H18ClN5O
Mol. Mass.:
379.843
SMILES:
Nc1ncnc2n(CC(Cl)c3ccccc3)nc(-c3ccc(CO)cc3)c12
: