Target
Metabotropic glutamate receptor 2
Ligand
BDBM50004852
Substrate
Meas. Tech.
ChEBML_218870
EC50
>1000000±n/a nM
Citation
 Madsen, UDumpis, MABräuner-Osborne, HPiotrovsky, LB Synthesis and pharmacology of N-alkylated derivatives of the excitotoxin ibotenic acid. Bioorg Med Chem Lett 8:1563-8 (1999)  
Target
Name:
Metabotropic glutamate receptor 2
Synonyms:
GPRC1B GRM2_HUMAN Metabotropic glutamate receptor mGlu2 | metabotropic glutamate 2
Type:
Enzyme
Mol. Mass.:
95584.88
Organism:
Homo sapiens (Human)
Description:
Q14416
Residue:
872
  
Inhibitor
Name:
BDBM50004852
Synonyms:
AMAA Amino-(3-hydroxy-5-methyl-isoxazol-4-yl)-acetic acid (D-AMAA) | CHEMBL280585
Type:
Small organic molecule
Emp. Form.:
C6H8N2O4
Mol. Mass.:
172.1387
SMILES:
Cc1o[nH]c(=O)c1C(N)C(O)=O
: