Target
Metabotropic glutamate receptor 4
Ligand
BDBM50400856
Substrate
Meas. Tech.
ChEBML_219023
EC50
20000±n/a nM
Citation
 Pellicciari, RCostantino, GGiovagnoni, EMattoli, LBrabet, IPin, JP Synthesis and preliminary evaluation of (S)-2-(4'-carboxycubyl)glycine, a new selective mGluR1 antagonist. Bioorg Med Chem Lett 8:1569-74 (1999)  
Target
Name:
Metabotropic glutamate receptor 4
Synonyms:
GPRC1D GRM4_HUMAN MGLUR4 Metabotropic glutamate receptor 4 (mGlu4) metabotropic glutamate 4
Type:
Protein
Mol. Mass.:
101899.95
Organism:
Homo sapiens (Human)
Description:
Q14833
Residue:
912
  
Inhibitor
Name:
BDBM50400856
Synonyms:
CHEMBL2021372
Type:
Small organic molecule
Emp. Form.:
C11H11NO4
Mol. Mass.:
221.2093
SMILES:
N[C@H](C(O)=O)C12C3C4C1C1C2C3C41C(O)=O
: