Target
Coagulation factor X
Ligand
BDBM50038002
Substrate
Meas. Tech.
ChEBML_48992
Ki
410±n/a nM
Citation
 Mohan, RYun, WBuckman, BOLiang, ATrinh, LMorrissey, MM Solid-phase synthesis of N-substituted amidinophenoxy pyridines as factor XA inhibitors. Bioorg Med Chem Lett 8:1877-82 (1999)  
Target
Name:
Coagulation factor X
Synonyms:
Activated coagulation factor X (FXa) Coagulation factor X precursor F10 Factor X heavy chain Factor Xa Stuart-Prower factor
Type:
Enzyme
Mol. Mass.:
54726.60
Organism:
Homo sapiens (Human)
Description:
Residue:
488
  
Inhibitor
Name:
BDBM50038002
Synonyms:
Benzamidine (Protonated) CHEMBL537204 | benzamidine
Type:
Small organic molecule
Emp. Form.:
C7H8N2
Mol. Mass.:
120.1518
SMILES:
NC(=N)c1ccccc1
: