Target
Cannabinoid receptor 2
Ligand
BDBM50200170
Substrate
Meas. Tech.
ChEMBL_1864130 (CHEMBL4365105)
Ki
1820±n/a nM
Citation
 Montanari, SMahmoud, AMPruccoli, LRabbito, ANaldi, MPetralla, SMoraleda, IBartolini, MMonti, BIriepa, IBelluti, FGobbi, SDi Marzo, VBisi, ATarozzi, ALigresti, ARampa, A Discovery of novel benzofuran-based compounds with neuroprotective and immunomodulatory properties for Alzheimer's disease treatment. Eur J Med Chem 178:243-258 (2019)  
Target
Name:
Cannabinoid receptor 2
Synonyms:
CANNABINOID CB2 CB2 CB2B CNR2_HUMAN Cannabinoid CB2 receptor Cannabinoid receptor 2 (CB2R) | hCB2
Type:
G Protein-Coupled Receptor (GPCR)
Mol. Mass.:
39690.94
Organism:
Homo sapiens (Human)
Description:
P34972
Residue:
360
  
Inhibitor
Name:
BDBM50200170
Synonyms:
5-(4-chloro-3-methyl-phenyl)-1-(4-methyl-benzyl)-1H-pyrazole-3-carboxylic acid ((1S,2S,4R)-1,3,3-trimethyl-bicyclo[2.2.1]hept-2-yl)-amide CHEMBL381791 | SR-144528
Type:
Small organic molecule
Emp. Form.:
C29H34ClN3O
Mol. Mass.:
476.053
SMILES:
Cc1ccc(Cn2nc(cc2-c2ccc(Cl)c(C)c2)C(=O)N[C@H]2[C@@]3(C)CC[C@H](C3)C2(C)C)cc1
: