Target
Beta-1 adrenergic receptor
Ligand
BDBM50071283
Substrate
Meas. Tech.
ChEBML_37378
IC50
2000±n/a nM
Citation
 Weber, AEOk, HOAlvaro, RFCandelore, MRCascieri, MAChiu, SHDeng, LForrest, MJHom, GJHutchins, JEKao, JMacIntyre, DEMathvink, RJMcLoughlin, DMiller, RRNewbold, RCOlah, TVParmee, ERPerkins, LStearns, RAStrader, CDSzumiloski, JTang, YSTota, LFisher, MH 3-Pyridyloxypropanolamine agonists of the beta 3 adrenergic receptor with improved pharmacokinetic properties. Bioorg Med Chem Lett 8:2111-6 (1999)  
Target
Name:
Beta-1 adrenergic receptor
Synonyms:
ADRB1 ADRB1_HUMAN Beta-1 adrenoceptor | adrenergic Beta1
Type:
G Protein-Coupled Receptor (GPCR)
Mol. Mass.:
51338.40
Organism:
Homo sapiens (Human)
Description:
P08588
Residue:
477
  
Inhibitor
Name:
BDBM50071283
Synonyms:
CHEMBL67672 | N-(4-{2-[(S)-3-(6-Amino-pyridin-3-yloxy)-2-hydroxy-propylamino]-ethyl}-phenyl)-4-fluoro-benzenesulfonamide
Type:
Small organic molecule
Emp. Form.:
C22H25FN4O4S
Mol. Mass.:
460.522
SMILES:
Nc1ccc(OC[C@@H](O)CNCCc2ccc(NS(=O)(=O)c3ccc(F)cc3)cc2)cn1
: