Target
Metabotropic glutamate receptor 5
Ligand
BDBM50072174
Substrate
Meas. Tech.
ChEBML_104635
IC50
5400±n/a nM
Citation
 Collado, IEzquerra, JMazón, APedregal, CYruretagoyena, BKingston, AETomlinson, RWright, RAJohnson, BGSchoepp, DD 2,3'-disubstituted-2-(2'-carboxycyclopropyl)glycines as potent and selective antagonists of metabotropic glutamate receptors. Bioorg Med Chem Lett 8:2849-54 (1999)  
Target
Name:
Metabotropic glutamate receptor 5
Synonyms:
GPRC1E GRM5_HUMAN metabotropic glutamate 5 | metabotropic glutamate 5a
Type:
Enzyme
Mol. Mass.:
132484.72
Organism:
Homo sapiens (Human)
Description:
Residue:
1212
  
Inhibitor
Name:
BDBM50072174
Synonyms:
(1S,2S,3S)-2-[1-Amino-1-carboxy-2-(9H-xanthen-9-yl)-ethyl]-3-nonyl-cyclopropanecarboxylic acid | CHEMBL420262
Type:
Small organic molecule
Emp. Form.:
C29H37NO5
Mol. Mass.:
479.6078
SMILES:
CCCCCCCCC[C@@H]1[C@@H]([C@H]1C(N)(CC1c2ccccc2Oc2ccccc12)C(O)=O)C(O)=O
: